Record#,Series#,Session#,Date of session,Time session began,Time session began - corrected,Time source for corrected time,Chronological Seq#,Receiver#,R's Sex,Sender#,S's sex,S/R Relationship,Experimenter#,E's Sex,Target#,Target Name,Dynamic Target?,Target Set#,Clip#1,Clip#2,Clip#3,Clip#4,Target,Judging Sequence,Target's position within the judging sequence,R1,R2,R3,R4,z1,z2,z3,z4,Raw Rating give to Target,z score of Target,Rank given to Target,Hit?,Judging Position selected,E1,E2,E3,E4,E5,E6,E7,E8,E9,R�s estimate of the time spent in ganzfeld mentation,E�s comments on the session,Prompted?,Light intensity on an arbitrary 100-point scale,White noise intensity on an arbitrary 7-point scale,AMOD?,Condition,R Session#n,Total number of sessions this R served as a receiver in entire database,S Session#n ,Total number of sessions this S served as a sender in entire database,E Session#n,Total number of sessions this E served as experimenter in entire database,Target Occurrence#n,Total number of sessions this target occurred as target in entire database,PIF#,Age,Education level,Degree of Belief in psi,Number of kinds of psi experience reported,Mental Discipline,MBTI code,EI score,SN score,TF score,JP score,Extravert? Derived from EI score above.,Julliard Student?,Lucid Dreamer,Competetive?,Enjoys public performances?,S aka R#,E aka R#,E aka S#
1,1,1,19/11/1982,16:27,16:59,R,1,1,M,1,M,F,2,M,156,THREE HORROR FILM FACES,0,39,153,154,155,156,4,1234,4,23,14,38,34,-0.45,-1.41,1.14,0.72,34,0.72,2,0,3,,,,,,,,,,,NO COMMENT,0,0,0,0,ND,1,3,1,1,1,53,1,3,46,45,18,6,1,1,INFP,145,133,107,119,0,0,,3,1,56,3,14
2,1,2,22/11/1982,15:07,15:07,C,2,2,M,2,M,LF,2,M,42,WOMAN'S HAIR STANDING ON END,0,11,41,42,43,44,2,1234,2,32,26,25,1,0.93,0.42,0.34,-1.69,26,0.42,2,0,1,,,,,,,,,,,CLOSE BUT NO CIGAR,0,0,0,0,D,1,2,1,27,2,53,1,5,40,40,18,5,2,1,INTJ,125,135,79,75,0,0,,5,1,8,3,14
3,1,3,23/11/1982,14:14,14:31,R,3,3,M,3,F,LF,4,M,92,ROAST BEEF- KNIFE & CORN,0,23,89,90,91,92,4,1234,4,11,23,17,40,-1.09,0.02,-0.53,1.59,40,1.59,1,1,4,,,,,,,,,,,DIRECT HIT!,0,0,0,0,D,1,3,1,19,1,72,1,4,50,31,18,6,4,0,INTJ,115,141,49,65,0,0,2,2,0,109,8,2
4,1,4,17/12/1982,10:04,10:04,C,4,4,M,4,F,F,2,M,59,TATTOO FACE,0,15,57,58,59,60,3,3412,1,24,7,40,1,0.39,-0.72,1.44,-1.11,40,1.44,1,1,1,,,,,,,,,,,DIRECT HIT!,0,0,0,0,D,1,3,1,4,3,53,1,3,148,52,18,6,1,1,ENFJ,95,145,133,97,1,0,1,6,1,116,3,14
5,1,5,05/01/1983,15:09,15:09,C,5,101,F,3,F,LF,2,M,51,DOLL EYES BEING PAINTED,0,13,49,50,51,52,3,4123,4,35,15,6,3,1.62,0.02,-0.7,-0.94,6,-0.7,3,0,2,,,,,,,,,,,SECOND SENDING PERIOD IMMEDIATELY FOLLOWED THE FIRST,0,0,0,0,ND,1,1,2,19,4,53,1,1,15,31,16,6,2,1,INTP,101,137,97,111,0,0,,6,1,109,3,14
6,1,6,18/01/1983,13:54,13:54,R,6,102,F,5,F,L,2,M,60,FOOTBALL SCENE,0,15,57,58,59,60,4,3412,2,33,25,38,5,0.62,-0.02,1.01,-1.61,5,-1.61,4,0,1,,,,,,,,,,,MICROPHONE CUT OUT-JOYSTICK FAILED,0,100,0,0,ND,1,1,1,1,5,53,1,4,68,,,,,,,,,,,,0,,,,,3,14
7,1,7,18/01/1983,16:28,16:28,R,7,5,M,6,F,F,2,M,3,TWO HUNTERS AND LARGE TREE,0,1,1,2,3,4,3,4123,4,20,38,33,29,-1.52,1.21,0.45,-0.15,33,0.45,2,0,3,,,,,,,,,,,NONE,0,100,0,0,D,1,2,1,2,6,53,1,2,8,50,17,7,1,1,ENTJ,75,133,71,69,1,0,,4,1,,3,14
8,1,8,01/02/1983,16:52,17:11,R,8,5,M,6,F,F,2,M,92,ROAST BEEF- KNIFE & CORN,0,23,89,90,91,92,4,2341,3,15,39,30,3,-0.49,1.25,0.6,-1.36,3,-1.36,4,0,1,,,,,,,,,,,NONE,0,100,0,0,ND,2,2,2,2,7,53,2,4,8,50,17,7,1,1,ENTJ,75,133,71,69,1,0,,4,1,,3,14
9,1,9,02/02/1983,12:15,12:50,R,9,103,F,7,M,L,2,M,18,EINSTEIN & GALAXIES,0,5,17,18,19,20,2,4123,3,34,24,3,1,1.32,0.61,-0.89,-1.04,24,0.61,2,0,2,,,,,,,,,,,NO IMAGERY-2ND CHOICE ON GUESS,0,100,0,0,D,1,1,1,16,8,53,1,3,69,44,12,7,1,1,ENFJ,77,113,101,83,1,0,1,7,1,,3,14
10,1,10,08/02/1983,13:09,13:18,R,10,6,M,7,M,L,2,M,99,BOY WITH FIREFLIES,0,25,97,98,99,100,3,1234,3,25,3,20,2,1.23,-0.93,0.74,-1.03,20,0.74,2,0,1,,,,,,,,,,,STRONG DISPLACEMENT- SHARK TARGET WAS SHOWN ONLY VERY BRIEFLY 1ST PRESENTATION,0,100,0,0,ND,1,1,2,16,9,53,1,4,75,37,17,6,2,1,ENFP,79,131,125,115,1,0,1,3,0,,3,14
11,1,11,21/02/1983,15:50,16:14,R,11,7,M,8,M,LF,2,M,90,DALI'S CHRIST CRUCIFIED,0,23,89,90,91,92,2,2341,1,18,38,20,2,-0.12,1.45,0.04,-1.37,38,1.45,1,1,1,,,,,,,,,,,DIRECT HIT!,0,100,0,0,D,1,7,1,11,10,53,1,1,77,48,18,6,1,1,ENFP,95,147,125,137,1,0,,3,1,2,3,14
12,1,12,09/03/1983,14:54,14:40,R,12,104,F,9,F,F,2,M,89,MARILYN MONROE AS BELLE ON BICYCLE,0,23,89,90,91,92,1,2341,4,37,27,6,1,1.3,0.63,-0.79,-1.13,37,1.3,1,1,4,,,,,,,,,,,DIRECT HIT!,0,100,0,0,ND,1,1,1,1,11,53,1,1,81,32,17,5,2,0,ESTJ,87,80,93,77,1,0,1,6,1,,3,14
13,1,13,14/03/1983,14:26,14:11,R,13,105,F,7,M,LF,2,M,18,EINSTEIN & GALAXIES,0,5,17,18,19,20,2,3412,4,5,10,40,18,-0.99,-0.62,1.62,-0.02,10,-0.62,3,0,1,,,,,,,,,,,NONE,0,100,0,0,ND,1,3,3,16,12,53,2,3,108,39,18,,1,1,ENFP,63,135,103,103,1,0,1,4,1,,3,14
14,1,14,17/03/1983,16:07,15:51,R,14,8,M,10,M,LF,2,M,132,DRAMBUIE LIQUOR & COUPLE,0,33,129,130,131,132,4,3412,2,2,38,32,20,-1.53,1.09,0.65,-0.22,20,-0.22,3,0,4,,,,,,,,,,,NONE,0,100,0,0,D,1,2,1,1,13,53,1,5,64,36,14,6,4,1,ISTP,101,97,85,103,0,0,1,7,1,,3,14
15,1,15,08/04/1983,16:08,15:53,R,15,106,F,2,M,LF,2,M,125,SUPERMAN CHASING MISSILES,1,32,125,126,127,128,1,4123,2,27,1,19,18,1.14,-1.61,0.29,0.18,27,1.14,1,1,2,,,,,,,,,,,NONE,0,0,0,0,D,1,3,2,27,14,53,1,4,35,44,12,7,2,1,ENFP,93,105,123,111,1,0,2,3,1,8,3,14
16,1,16,12/04/1983,15:44,15:29,E,16,9,M,11,F,F,2,M,77,TIDAL WAVE STRIKES ANCIENT CITY,1,20,77,78,79,80,1,4123,2,36,2,27,17,1.23,-1.47,0.52,-0.28,36,1.23,1,1,2,,,,,,,,,,,NONE,0,0,0,0,,1,3,1,3,15,53,1,15,87,33,18,6,4,1,INTJ,137,151,69,97,0,0,2,2,1,110,3,14
17,1,17,15/04/1983,15:29,15:13,E,17,3,M,8,M,L,4,M,80,BUGS BUNNY IN SPACE,1,20,77,78,79,80,4,4123,1,21,26,1,40,-0.07,0.29,-1.5,1.29,40,1.29,1,1,1,,,,,,,,,,,NONE,0,100,5,0,ND,2,3,2,11,2,72,1,16,50,31,18,6,4,0,INTJ,115,141,49,65,0,0,2,2,0,2,8,2
18,1,18,22/04/1983,15:05,14:51,R,18,107,F,12,M,F,2,M,62,TELEPATHIC FISH,1,16,61,62,63,64,2,3412,4,29,18,3,12,1.43,0.26,-1.32,-0.37,18,0.26,2,0,3,,,,,,,,,,,NONE,0,0,0,0,ND,1,1,1,1,16,53,1,1,4,,,,,,,,,,,,0,,,,10,3,14
19,1,19,22/04/1983,16:42,16:27,R,19,10,M,13,F,F,2,M,64,1920'S CAR SINKING,1,16,61,62,63,64,4,3412,2,1,9,28,21,-1.32,-0.55,1.27,0.6,21,0.6,2,0,1,,,,,,,,,,,NONE,0,0,0,0,ND,1,1,1,1,17,53,1,6,3,,,,,,,,,,,,0,,,,107,3,14
20,1,20,27/04/1983,18:59,18:59,R,20,3,M,2,M,LF,1,F,126,HORSEMEN ATTACKING HASSIDIC COMMUNITY,1,32,125,126,127,128,2,4123,3,29,1,7,40,0.61,-1.15,-0.77,1.31,1,-1.15,4,0,1,,,,,,,,,,,NONE,0,100,4,0,D,3,3,3,27,1,45,1,4,50,31,18,6,4,0,INTJ,115,141,49,65,0,0,2,2,0,8,109,3
21,1,21,04/05/1983,15:45,15:30,E,21,108,F,7,M,LF,1,F,71,BUTTERFLIES,1,18,69,70,71,72,3,4123,4,12,14,33,27,-1.08,-0.85,1.31,0.63,33,1.31,1,1,4,1,3,1,1,1,1,0,1,1,,,0,0,0,0,ND,1,3,4,16,2,45,1,1,89,43,16,7,2,1,INFP,107,125,113,131,0,0,5,5,0,,109,3
22,1,22,07/06/1983,16:01,15:45,R,24,109,F,14,M,F,8,M,59,TATTOO FACE,0,15,57,58,59,60,3,3412,1,38,30,19,1,1.15,0.58,-0.22,-1.51,19,-0.22,3,0,3,,,,,,,,,,,RICK FELT HARD TGT TO SEND - SESSION INTERRUPTION,0,80,4,0,D,1,1,1,5,1,42,2,3,48,36,15,6,3,1,ENTP,81,121,81,119,1,0,1,6,1,3,,7
23,2,1,27/09/1983,12:01,11:40,R,59,113,F,,,,2,M,74,MEN WORKING IN A FACTORY,0,19,73,74,75,76,2,3412,4,1,5,36,24,-1.09,-0.81,1.37,0.53,5,-0.81,3,0,1,5,4,4,3,4,2,2,4,4,,LOOKED LIKE DISPLACEMENT!!!NO SENDER,0,92,2,0,ND,4,4,,,33,53,1,2,95,48,12,7,3,1,ENFP,81,121,137,115,1,0,3,1,1,,3,14
24,2,2,10/10/1983,13:36,13:15,R,64,7,M,7,M,LF,2,M,7,BISHOP'S CORONATION,1,2,5,6,7,8,3,3412,1,4,7,40,1,-0.57,-0.38,1.72,-0.76,40,1.72,1,1,1,6,1,1,4,6,5,4,5,5,,NONE,0,100,2,0,D,5,7,10,16,34,53,1,2,77,48,18,6,1,1,ENFP,95,147,125,137,1,0,,3,1,,3,14
25,2,3,07/12/1983,14:58,14:30,R,75,124,F,29,F,F,2,M,145,INDIAN SWORDFIGHT PAINTING,0,37,145,146,147,148,1,1234,1,40,5,4,33,1.2,-0.96,-1.02,0.77,40,1.2,1,1,1,2,1,1,1,2,1,1,1,3,,NONE,0,70,1,0,ND,2,4,2,3,36,53,1,2,110,36,16,7,2,1,INFP,123,141,125,141,0,0,1,1,0,,3,14
26,2,4,16/01/1984,17:02,16:45,R,82,24,M,33,M,F,2,M,139,TWO MEN IN BOAT FISHING,0,35,137,138,139,140,3,2341,2,40,1,7,15,1.63,-0.99,-0.59,-0.05,7,-0.59,3,0,4,4,4,5,5,4,4,3,3,5,,LOOKED LIKE DISPLACEMENT TO FIRST TARGET IN PREVIEWS AS VIEWED BY EXPERIMENTER,0,100,2.5,0,D,2,3,1,1,37,53,2,3,58,41,17,6,4,1,INTP,103,139,77,111,0,0,5,5,0,26,3,14
27,2,5,20/01/1984,17:58,17:45,R,85,26,M,34,M,F,2,M,21,BIRD & OLYMPUS GODS,1,6,21,22,23,24,1,3412,3,40,12,6,1,1.67,-0.18,-0.58,-0.91,40,1.67,1,1,3,4,3,1,4,4,5,4,4,5,,NONE,0,90,4,0,ND,1,1,1,1,38,53,1,3,0,,,,,,,,,,,,0,,,,24,3,14
28,2,6,08/02/1984,18:22,18:00,R,90,24,M,38,F,F,2,M,44,TWO MEN HUNTING ON A BOAT,0,11,41,42,43,44,4,3412,2,15,1,40,10,-0.1,-1.07,1.62,-0.45,10,-0.45,3,0,1,4,4,4,4,4,4,3,4,5,,LOOKED LIKE DISPLACEMENT TO FIRST TARGET SHOWN TO E (LONG VERSION),0,85,2,0,ND,3,3,1,1,39,53,1,2,58,41,17,6,4,1,INTP,103,139,77,111,0,0,5,5,0,,3,14
29,2,7,20/02/1984,7:00,14:52,R,91,124,F,29,F,F,2,M,94,HANG GLIDER,1,24,93,94,95,96,2,1234,2,23,10,40,1,0.31,-0.58,1.47,-1.19,10,-0.58,3,0,3,3,1,1,1,2,2,2,2,4,,NONE,0,80,2,0,D,3,4,3,3,40,53,1,4,110,36,16,7,2,1,INFP,123,141,125,141,0,0,1,1,0,,3,14
30,2,8,22/03/1984,15:37,15:22,R,96,7,M,3,F,LF,2,M,50,MOTORCYCLES RACING,0,13,49,50,51,52,2,1234,2,18,1,5,40,0.13,-0.99,-0.72,1.58,1,-0.99,4,0,4,6,2,1,6,6,4,4,5,5,,FOUR-SIX SENDING PERIODS WERE BEGUN WITH 'SUDDENLY MY MIND HAS SHIFTED...',0,84,3,0,ND,6,7,16,19,42,53,3,6,77,48,18,6,1,1,ENFP,95,147,125,137,1,0,,3,1,109,3,14
31,2,9,13/06/1984,12:01,11:45,R,113,7,M,3,F,L,2,M,16,ROCK CONCERT AND COMPUTER GRAPHICS,1,4,13,14,15,16,4,2341,3,11,15,40,1,-0.4,-0.12,1.62,-1.1,1,-1.1,4,0,2,6,3,1,5,5,4,4,6,5,,LOOKED LIKE DISPLACEMENT TO JAPANESE CAVALRY ATTACK--EXTREMELY GOOD CORRESPONDENCES,0,95,2,0,ND,7,7,18,19,44,53,2,3,77,48,18,6,1,1,ENFP,95,147,125,137,1,0,,3,1,109,3,14
32,3,1,21/07/1983,16:43,16:28,E,42,8,M,21,F,LF,8,M,78,SNAKES,1,20,77,78,79,80,2,1234,2,32,21,5,2,1.4,0.49,-0.82,-1.07,21,0.49,2,0,1,5,3,6,2,5,4,2,4,5,,CLOSE CALL,0,85,4.5,0,ND,2,2,1,15,8,42,1,8,64,36,14,6,4,1,ISTP,101,97,85,103,0,0,1,7,1,143,,7
33,3,2,03/08/1983,13:57,13:42,E,45,7,M,3,F,LF,8,M,15,JAPANESE CAVALRY ATTACK,1,4,13,14,15,16,3,1234,3,15,19,40,35,-1.17,-0.79,1.21,0.74,40,1.21,1,1,3,6,0,2,3,4,1,1,1,2,,RBERGER RE-RANDOMIZED AFTER 1ST SENDING PERIOD & AFTER MAIN CORRESPONDENCES HAD BEEN GIVEN.CRASH DUE TO NOT ON FRAME TABLE.,0,84,3,0,D,4,7,7,19,9,42,1,2,77,48,18,6,1,1,ENFP,95,147,125,137,1,0,,3,1,109,,7
34,3,3,19/05/1984,16:38,16:22,E,105,134,F,2,M,L,8,M,19,FLYING EAGLE,0,5,17,18,19,20,3,3412,1,35,5,32,28,0.85,-1.69,0.59,0.25,32,0.59,2,0,3,5,4,1,4,5,2,2,3,4,,NONE,0,90,4,0,ND,2,2,9,27,27,42,2,7,127,37,12,7,2,1,ENFJ,99,113,139,71,1,0,1,1,0,8,,7
35,3,4,20/07/1984,15:49,15:34,E,126,143,F,7,M,LF,6,M,87,WHITE BIRD,1,22,85,86,87,88,3,2341,2,31,29,17,1,0.96,0.8,-0.21,-1.55,17,-0.21,3,0,4,5,0,2,2,4,2,3,3,3,,SHE HAD A VERY HARD TIME MAKING HER RATINGS.,0,45,0.5,0,ND,1,1,14,16,1,14,1,1,62,33,17,7,2,1,ENTP,69,147,95,133,1,0,3,6,0,,2,8
36,3,5,30/08/1984,16:39,16:24,E,133,39,M,53,F,F,1,F,37,HELICOPTER BATTLE,1,10,37,38,39,40,1,3412,3,30,18,7,20,1.38,-0.09,-1.44,0.15,30,1.38,1,1,3,3,3,1,0,1,0,0,0,2,,NONE,0,100,3,0,ND,1,1,1,1,31,45,2,2,158,32,16,7,3,1,ESTJ,73,99,71,77,1,0,0,4,1,144,109,3
37,3,6,25/03/1985,11:18,11:04,R,155,152,F,61,F,L,5,F,15,JAPANESE CAVALRY ATTACK,1,4,13,14,15,16,3,4123,4,2,33,37,3,-1.03,0.87,1.12,-0.97,37,1.12,1,1,4,3,1,2,0,4,0,0,2,4,,DECISION AS TO WHICH WAS THE TARGET WAS MADE QUICKLY.  THE OTHERES WERE DISREGARDED IMMEDIATELY.,0,60,1,0,ND,1,3,1,49,1,106,2,2,204,59,14,7,1,1,ENFP,55,139,127,131,1,0,3,4,0,168,163,76
38,3,7,29/10/1985,14:58,14:43,E,175,158,F,8,M,L,4,M,3,TWO HUNTERS AND LARGE TREE,0,1,1,2,3,4,3,4123,4,37,33,40,35,0.29,-1.26,1.45,-0.48,40,1.45,1,1,4,5,1,0,0,5,2,5,5,4,,MENTATION NOT FULLY TAPED,0,100,2.5,0,ND,2,3,9,11,33,72,2,2,191,39,16,7,3,1,ENFP,89,143,107,135,1,0,1,6,1,2,8,2
39,3,8,16/12/1985,14:01,13:46,E,181,55,M,2,M,LF,6,M,120,DANCING ON A BIPLANE,1,30,117,118,119,120,4,3412,2,32,4,37,2,0.84,-0.93,1.15,-1.06,2,-1.06,4,0,1,4,2,0,0,5,1,2,5,2,,LIGHT INTENSITY - 90: SENDER DID NOT GET FULL RELAXATION EXERCIZE OR FULL ID OF CLIPS DURING JUDGING,0,90,3,0,D,1,1,14,27,3,14,1,1,144,60,18,,,,,,,,,,0,,,,8,2,8
40,3,9,11/03/1986,16:03,15:48,E,187,168,F,77,F,LF,6,M,103,DOLPHINS,1,26,101,102,103,104,3,1234,3,1,4,18,40,-0.96,-0.76,0.15,1.57,18,0.15,2,0,4,2,3,3,4,2,1,2,2,2,,NONE,1,60,2,0,D,1,2,1,4,6,14,2,4,84,34,12,5,2,0,ISFJ,117,99,113,71,0,0,1,3,0,161,2,8
41,3,10,18/04/1986,11:14,11:23,R,192,2,M,61,F,L,5,F,95,RUSSIAN HEADS OF STATE,1,24,93,94,95,96,3,4123,4,33,5,28,13,1.18,-1.31,0.73,-0.6,28,0.73,2,0,2,6,3,3,1,6,5,3,6,5,,FEELINGS TO EACH SEQUNECE WAS CLEAR/DEFINITE.,1,87,2,0,D,2,2,2,49,2,106,1,2,40,40,18,5,2,1,INTJ,125,135,79,75,0,0,,5,1,168,163,76
42,3,11,22/04/1986,14:58,14:58,R,193,152,F,2,M,L,5,F,88,WORLD WAR II NEWSREELS,1,22,85,86,87,88,4,2341,3,9,34,6,1,-0.27,1.69,-0.51,-0.9,1,-0.9,4,0,1,2,1,4,2,2,2,2,1,6,,GINNIE HAS GREAT AVERSION TO WW2 RELATED MATERIALS. GAVE IT A 0. NO REACTION.,1,50,0.5,0,ND,3,3,16,27,3,106,1,2,204,59,14,7,1,1,ENFP,55,139,127,131,1,0,3,4,0,8,163,76
43,3,12,30/05/1986,8:44,10:55,R,203,169,F,61,F,L,5,F,57,MICHAELANGELO'S 'CREATION OF ADAM',0,15,57,58,59,60,1,1234,1,32,40,6,22,0.55,1.18,-1.5,-0.24,32,0.55,2,0,2,1,2,1,0,2,2,0,1,5,,VERY LITTLE MENTATION,1,70,2,0,D,2,4,8,49,11,106,4,5,207,35,13,7,4,0,ENFP,69,119,103,113,1,0,4,1,0,168,163,76
44,3,13,17/06/1986,9:08,10:27,R,207,167,F,84,F,F,5,F,19,FLYING EAGLE,0,5,17,18,19,20,3,1234,3,2,16,40,1,-0.81,0.08,1.6,-0.87,40,1.6,1,1,3,6,3,3,2,6,6,1,6,6,,LOTS OF MENTATION DESCRIBING TARGHET,1,40,1,0,ND,2,4,1,1,14,106,3,7,198,43,17,7,3,1,ENFJ,85,109,115,51,1,0,2,5,1,172,163,76
45,3,14,30/06/1986,10:00,14:38,R,214,179,F,55,M,LF,5,F,8,CLOWN & DANCER STRIPPING,1,2,5,6,7,8,4,3412,2,40,1,12,5,1.67,-0.89,-0.16,-0.62,5,-0.62,3,0,3,2,1,1,1,4,3,1,3,6,,SEX TARGET AVOIDED,1,25,0.5,0,D,2,4,17,40,18,106,3,4,208,37,18,7,4,1,INTJ,137,141,83,63,0,0,1,4,1,39,163,76
46,3,15,08/07/1986,9:47,11:00,R,216,167,F,61,F,L,5,F,159,GANGSTER WARS,1,40,157,158,159,160,3,2341,2,39,23,1,7,1.45,0.37,-1.12,-0.71,1,-1.12,4,0,4,6,1,0,0,6,1,1,4,6,,TOO MANY COOROLATIONS TO EACH SELCTION IN POOL,1,50,1.5,0,ND,3,4,11,49,20,106,1,1,198,43,17,7,3,1,ENFJ,85,109,115,51,1,0,2,5,1,168,163,76
47,3,16,14/07/1986,10:35,11:36,R,219,62,M,55,M,L,6,M,14,FLYING FROGS,1,4,13,14,15,16,2,4123,3,11,34,28,20,-1.42,1.24,0.55,-0.38,34,1.24,1,1,3,4,0,0,0,4,0,3,3,3,,GOOD SESSION,1,73,2.7,0,D,1,1,18,40,14,14,1,4,5,,,,,,,,,,,,0,,,,39,2,8
48,3,17,15/07/1986,11:12,13:35,R,220,124,F,61,F,L,5,F,1,VIEW OF THE EARTH FROM THE MOON,0,1,1,2,3,4,1,1234,1,25,6,40,29,0,-1.55,1.22,0.33,25,0,3,0,3,5,0,0,0,4,4,0,3,6,,CORROLATIONS TO OTHER TARGET POSSIBILITY STRONG,1,30,0.5,0,ND,4,4,12,49,23,106,1,2,110,36,16,7,2,1,INFP,123,141,125,141,0,0,1,1,0,168,163,76
49,3,18,12/08/1986,8:41,10:25,R,225,172,F,79,F,F,5,F,35,GIRL WITH EARRINGS,0,9,33,34,35,36,3,3412,1,1,28,13,40,-1.32,0.51,-0.51,1.32,13,-0.51,3,0,2,6,6,6,6,6,6,3,6,6,,BASED ON PRECOGNITIVE MATERIALS,1,40,1,0,D,2,2,2,3,28,106,2,2,213,38,14,7,4,1,ENFP,59,145,115,125,1,0,6,5,1,167,163,76
50,3,19,19/09/1986,8:54,10:38,R,236,64,M,79,F,F,5,F,116,SPEEDBOATS,0,29,113,114,115,116,4,3412,2,38,20,4,29,1.21,-0.22,-1.49,0.5,29,0.5,2,0,3,6,4,4,4,6,5,1,6,6,,STRONG CORRESPONDANCES TO ALL FOUR TARGETS.  HIGH EMOTIONAL FEELING FOR SECOND CHOICE,1,50,1,0,D,2,2,3,3,36,106,4,4,237,24,17,7,4,1,ENFP,93,141,125,145,1,0,4,5,1,167,163,76
51,3,20,24/09/1986,7:57,09:39,R,237,193,F,96,F,F,5,F,45,ELECTRIC HORSEMAN,1,12,45,46,47,48,1,3412,3,39,9,3,36,1.08,-0.8,-1.18,0.89,39,1.08,1,1,3,6,1,0,1,5,4,0,5,5,,VERY CLOSE DESCRIPTION TO TARGET,1,55,2,0,ND,1,2,1,1,37,106,2,2,247,20,13,7,3,0,ENFP,73,117,107,109,1,0,3,5,0,,163,76
52,3,21,17/04/1987,13:38,14:35,E,254,169,F,101,F,L,5,F,119,FACE TRANSFORMATIONS,1,30,117,118,119,120,3,4123,4,40,13,39,25,0.97,-1.46,0.88,-0.38,39,0.88,2,0,2,1,0,0,0,1,0,1,1,6,5,VERY LITTLE MENTATION,1,70,2,0,ND,3,4,1,2,53,106,1,1,207,35,13,7,4,0,ENFP,69,119,103,113,1,0,4,1,0,195,163,76
53,3,22,23/04/1987,9:49,10:45,R,256,195,F,61,F,LF,5,F,19,FLYING EAGLE,0,5,17,18,19,20,3,2341,2,6,18,36,40,-1.38,-0.51,0.8,1.09,36,0.8,2,0,3,5,2,1,0,4,3,0,5,6,60,CLOSE DECISION,1,75,2,0,D,2,3,22,49,55,106,6,7,251,40,17,7,3,1,INFP,105,143,135,103,0,0,1,3,0,168,163,76
54,3,23,24/07/1987,9:42,10:42,E,267,168,F,104,F,F,5,F,10,SANTA WITH COKE,0,3,9,10,11,12,2,2341,1,40,19,38,2,0.99,-0.37,0.86,-1.47,19,-0.37,3,0,4,4,6,6,6,5,5,0,5,6,15,NONE,1,45,1.5,0,D,2,2,1,2,66,106,1,2,84,34,12,5,2,0,ISFJ,117,99,113,71,0,0,1,3,0,207,163,76
55,3,24,09/09/1987,13:29,14:29,E,278,210,F,61,F,L,5,F,26,TWO BELLS,0,7,25,26,27,28,2,1234,2,3,28,15,39,-1.35,0.5,-0.46,1.31,28,0.5,2,0,4,6,6,6,6,4,4,0,3,6,20,LOTS OF PHYSICA,1,40,1,0,D,3,10,38,49,76,106,1,1,286,40,12,5,1,1,ENFJ,65,103,111,71,1,0,1,5,0,168,163,76
56,3,25,24/09/1987,9:23,10:23,E,281,210,F,61,F,L,5,F,149,BUSTER KEATON CHASED BY BOULDERS,1,38,149,150,151,152,1,2341,4,35,39,1,14,0.82,1.08,-1.37,-0.53,35,0.82,2,0,1,4,6,6,4,4,5,6,5,6,30,CORRESPONDENCES TO BOTH PEGASUS AND BUSTER KEATON,1,40,1,0,D,4,10,39,49,78,106,3,3,286,40,12,5,1,1,ENFJ,65,103,111,71,1,0,1,5,0,168,163,76
57,3,26,23/10/1987,12:54,13:54,E,289,211,F,109,M,F,5,F,101,TRAIN BREAKING HANDCUFFS,1,26,101,102,103,104,1,2341,4,1,38,35,33,-1.72,0.75,0.55,0.42,1,-1.72,4,0,1,5,2,3,5,5,3,4,5,6,10,NONE,1,45,1,0,ND,2,2,1,1,84,106,1,1,287,43,18,7,2,1,ENFJ,81,127,133,93,1,0,1,3,1,84,163,76
58,3,27,24/11/1987,13:30,13:30,C,299,210,F,61,F,L,5,F,123,ANCIENT GREEK VASE & STATUES,0,31,121,122,123,124,3,4123,4,28,18,38,1,0.49,-0.24,1.23,-1.48,38,1.23,1,1,4,4,6,6,6,3,4,0,3,6,20,NONE,1,40,3,1,ND,5,10,46,49,91,106,2,2,286,40,12,5,1,1,ENFJ,65,103,111,71,1,0,1,5,0,168,163,76
59,3,28,10/12/1987,15:00,15:00,C,303,210,F,2,M,L,5,F,1,VIEW OF THE EARTH FROM THE MOON,0,1,1,2,3,4,1,3412,3,33,40,13,1,0.72,1.17,-0.56,-1.33,33,0.72,2,0,4,3,6,5,6,4,3,0,4,6,,NONE,1,60,2,1,D,6,10,23,27,95,106,2,2,286,40,12,5,1,1,ENFJ,65,103,111,71,1,0,1,5,0,8,163,76
60,3,29,12/01/1988,13:05,13:05,C,309,210,F,61,F,L,5,F,77,TIDAL WAVE STRIKES ANCIENT CITY,1,20,77,78,79,80,1,3412,3,15,2,33,40,-0.5,-1.37,0.7,1.17,15,-0.5,3,0,2,1,2,2,1,1,6,1,1,6,20,EQUIPMENT NOT FUNCTIONING CORRECTLY MIC NOT WORKING IN RECEIVER,1,70,3,1,D,7,10,49,49,100,106,13,15,286,40,12,5,1,1,ENFJ,65,103,111,71,1,0,1,5,0,168,163,76
61,3,30,19/01/1988,16:49,16:49,C,311,210,F,117,F,F,5,F,140,"ADVERTISEMENT FOR FILM ""1941""",0,35,137,138,139,140,4,1234,4,40,19,28,1,1.26,-0.21,0.42,-1.48,1,-1.48,4,0,1,6,3,0,3,3,3,0,4,6,25,TV CREW HERE,1,60,2,1,ND,8,10,1,1,102,106,1,1,286,40,12,5,1,1,ENFJ,65,103,111,71,1,0,1,5,0,216,163,76
62,3,31,25/02/1988,,,,315,31,M,120,F,F,5,F,94,HANG GLIDER,1,24,93,94,95,96,2,2341,1,3,30,25,27,-1.71,0.82,0.35,0.54,30,0.82,1,1,1,5,6,5,5,4,5,1,4,6,,NONE,1,70,2,1,ND,2,2,1,1,106,106,4,4,124,50,12,7,4,1,INTP,111,131,79,105,0,0,6,1,1,,163,76
63,3,32,10/10/1988,15:00,15:00,C,319,210,F,55,M,L,4,M,118,CHARLIE CHAPLIN ON STATUE,1,30,117,118,119,120,2,2341,1,8,32,11,27,-1.13,1.22,-0.83,0.73,32,1.22,1,1,1,4,5,1,1,3,4,0,1,3,,TV SESSION -DIRECT HIT!,1,76,4,1,D,9,10,25,40,59,72,1,1,286,40,12,5,1,1,ENFJ,65,103,111,71,1,0,1,5,0,39,8,2
64,3,33,04/11/1988,15:13,14:15,R,320,117,F,55,M,L,4,M,67,JAPANESE GARDEN,0,17,65,66,67,68,3,2341,2,37,18,27,12,1.43,-0.58,0.37,-1.22,27,0.37,2,0,4,5,4,4,4,5,3,5,6,5,,2ND,1,100,6.5,1,D,4,4,26,40,60,72,2,2,101,38,16,7,3,1,ENFP,83,145,133,141,1,0,2,2,1,39,8,2
65,3,34,19/07/1989,13:41,13:41,C,353,210,F,131,F,L,3,F,93,INSECTS,1,24,93,94,95,96,1,2341,4,21,39,1,32,-0.16,1.1,-1.55,0.61,21,-0.16,3,0,1,3,1,1,0,3,2,1,1,5,,NONE,1,83,3.5,1,D,10,10,1,1,14,15,1,1,286,,,,,,,,,,,,0,,,,240,,127
66,3,35,20/07/1989,13:26,13:26,C,354,228,F,55,M,L,3,F,78,SNAKES,1,20,77,78,79,80,2,1234,2,13,10,3,27,-0.03,-0.37,-1.17,1.58,10,-0.37,3,0,4,4,1,0,0,5,4,4,3,5,,NONE,1,78,3.5,1,D,3,3,40,40,15,15,8,8,316,,,,,,,,,,,,0,,,,39,,127
67,101,1,17/05/1983,17:07,16:52,E,22,11,M,8,M,L,2,M,126,HORSEMEN ATTACKING HASSIDIC COMMUNITY,1,32,125,126,127,128,2,3412,4,34,30,10,15,1.17,0.77,-1.22,-0.72,30,0.77,2,0,3,5,3,1,3,5,5,4,5,6,,70 SEC DELAY BETWEEN S.P'S,0,100,7,0,ND,1,1,3,11,18,53,2,4,160,44,18,,,,INTP,121,147,83,107,0,0,0,,,2,3,14
68,101,2,13/06/1983,18:15,17:50,R,26,12,M,3,F,L,8,M,99,BOY WITH FIREFLIES,0,25,97,98,99,100,3,1234,3,10,30,14,27,-1.21,1.16,-0.74,0.8,14,-0.74,3,0,2,0,1,3,0,2,0,1,2,1,,S SLEPT ALOT,0,100,7,0,ND,1,1,4,19,2,42,2,4,91,43,18,5,2,1,INTJ,117,125,59,65,0,0,1,5,1,109,,7
69,101,3,15/06/1983,17:16,17:00,R,29,110,F,15,F,F,8,M,54,GARBAGE TALK,1,14,53,54,55,56,2,3412,4,27,4,36,12,0.58,-1.26,1.3,-0.62,4,-1.26,4,0,1,6,2,3,4,6,3,3,4,5,,JEFF PREDICTED #4,0,60,5,0,ND,1,1,1,1,3,42,1,5,88,27,16,6,3,1,INTP,125,143,75,123,0,0,2,2,0,9,,7
70,101,4,17/06/1983,15:39,15:20,R,30,111,F,7,M,LF,2,M,63,HORSES,1,16,61,62,63,64,3,3412,1,8,11,34,32,-1.12,-0.87,1.08,0.91,34,1.08,1,1,1,1,6,6,1,0,0,0,0,0,,RESTARTED SENDING PERIOD AFTER TAPE RAN AWAY,0,60,1.5,0,D,1,3,5,16,23,53,1,5,92,25,16,7,3,1,INFJ,125,139,103,87,0,0,1,2,0,,3,14
71,101,5,27/06/1983,15:48,15:30,R,33,112,F,16,F,F,8,M,50,MOTORCYCLES RACING,0,13,49,50,51,52,2,1234,2,5,32,34,37,-1.72,0.39,0.55,0.78,32,0.39,3,0,4,3,5,1,1,4,3,0,2,3,,RECEIVER MISUNDERSTOOD INSTRUCTIONS. CORRECTLY CHOSE TGT FOR SENDERS EXPERIENCE BUT NOT HER OWN AND RANKED CORRECT TGT THIRD.,0,100,7,0,ND,1,3,1,1,5,42,1,6,96,45,17,7,4,1,INFP,123,149,123,133,0,0,1,1,1,,,7
72,101,6,28/06/1983,14:32,14:17,R,34,113,F,17,M,F,2,M,52,EAGLE CAPTURING A RODENT,0,13,49,50,51,52,4,3412,2,38,29,37,32,1.09,-1.36,0.82,-0.54,32,-0.54,3,0,3,6,5,5,5,6,5,4,4,5,,TV NOT ON-MISSED SHORTS,0,80,2.5,0,D,1,4,1,1,25,53,1,2,95,48,12,7,3,1,ENFP,81,121,137,115,1,0,3,1,1,,3,14
73,101,7,30/06/1983,15:52,15:36,R,35,13,M,18,M,F,2,M,77,TIDAL WAVE STRIKES ANCIENT CITY,1,20,77,78,79,80,1,3412,3,14,6,30,1,0.11,-0.61,1.57,-1.07,14,0.11,2,0,1,1,1,1,1,1,2,0,0,0,,DISPLACEMENT TO FIRST TARGET SHOWN?,0,60,1.5,0,D,1,1,1,1,26,53,2,15,161,,,,,,,,,,,,0,,,,16,3,14
74,101,8,13/07/1983,14:05,13:50,R,38,14,M,14,M,L,8,M,125,SUPERMAN CHASING MISSILES,1,32,125,126,127,128,1,3412,3,8,31,5,28,-0.86,1.12,-1.12,0.86,8,-0.86,3,0,4,3,4,1,2,4,2,2,3,4,,THERE WERE SEVERAL GOOD INDIRECT CORRESPONDENCES BUT S QUICKLY DISMISSED POSSIBILITY OF TGT W-OUT CLOSELY REVIEWING MENTATION,0,86,5.5,0,D,1,3,2,5,6,42,2,4,99,33,16,7,3,0,ENTP,79,137,67,121,1,0,,,0,3,,7
75,101,9,16/08/1983,15:11,14:55,R,47,114,F,22,F,F,2,M,9,GREEK VILLAGE & OLD WOMAN,0,3,9,10,11,12,1,2341,4,18,5,35,7,0.15,-0.95,1.58,-0.78,18,0.15,2,0,2,3,1,0,0,3,1,2,1,3,,NONE,0,88,3,0,D,1,1,1,1,30,53,1,5,100,52,14,5,2,1,INFP,103,143,133,133,0,0,1,6,1,,3,14
76,101,10,16/08/1983,17:44,17:30,R,48,15,M,21,F,L,8,M,8,CLOWN & DANCER STRIPPING,1,2,5,6,7,8,4,3412,2,26,12,36,18,0.33,-1.22,1.44,-0.56,18,-0.56,3,0,1,5,1,2,1,6,3,1,3,3,,FIRST TARGET SEEN- BISHOP CORONATION,0,37,2,0,ND,1,1,2,15,11,42,1,4,162,,18,,,,OOOO,,,,,,0,,,,143,,7
77,101,11,17/08/1983,16:46,16:28,R,49,16,M,23,F,F,2,M,16,ROCK CONCERT AND COMPUTER GRAPHICS,1,4,13,14,15,16,4,2341,3,3,34,25,8,-1.16,1.32,0.6,-0.76,8,-0.76,3,0,1,2,3,0,0,2,1,1,1,1,,RATED TARGETS IN THE SAME ORDER AS FULL PRESENTATION ORDER,0,100,3,0,D,1,1,1,1,31,53,1,3,80,27,17,7,2,0,ENTP,59,133,91,121,1,0,3,2,1,,3,14
78,101,12,18/08/1983,14:53,14:21,R,50,17,M,21,F,LF,4,M,98,ROOSEVELT & CHURCHILL & STALIN,0,25,97,98,99,100,2,2341,1,1,30,24,8,-1.26,1.22,0.7,-0.66,30,1.22,1,1,1,5,3,0,3,4,2,4,5,4,,NONE,0,100,4,0,ND,1,1,3,15,4,72,1,2,163,,,,,,OOOO,,,,,,0,,,,143,8,2
79,101,13,22/08/1983,19:10,18:58,R,51,115,F,24,M,F,4,M,70,DANCING IN (N.Y.) STREETS,1,18,69,70,71,72,2,1234,2,7,13,40,18,-1,-0.52,1.65,-0.12,13,-0.52,3,0,3,4,5,5,5,2,1,0,1,1,,NONE,0,100,4,0,D,1,1,1,1,5,72,1,5,164,,,,,,OOOO,,,,,,0,,,,,8,2
80,101,14,08/09/1983,11:18,11:01,R,54,118,F,7,M,L,1,F,50,MOTORCYCLES RACING,0,13,49,50,51,52,2,2341,1,20,5,3,13,1.44,-0.78,-1.07,0.41,5,-0.78,3,0,4,0,5,4,1,0,0,0,0,1,,NONE,0,100,3,0,ND,1,1,9,16,6,45,2,6,98,39,18,7,2,1,ENFJ,97,119,135,87,1,0,1,2,1,,109,3
81,101,15,13/09/1983,16:56,16:35,R,55,18,M,21,F,LF,8,M,52,EAGLE CAPTURING A RODENT,0,13,49,50,51,52,4,2341,3,37,17,13,3,1.58,-0.04,-0.36,-1.17,3,-1.17,4,0,4,6,0,1,1,6,2,3,6,4,,SUBJECT WAS DEFENSIVE TOWARDS TARGET AND CHANGED RATING FROM THIRD TO FOURTH,0,60,2,0,D,1,1,4,15,12,42,2,2,165,,,,,,OOOO,,,,,,0,,,,143,,7